{"text_format":"1","workbook":"xlsx","n_sheets":11,"sheets":["Suivi","Cas de tests internes","Indicateurs Tests","Liste des Bénéficiaires","Liste des ETS","Bénéficiaires","Configuration","Contacts","Remarques","Paramétrage SoapUi","Fichier de paramétrage vierge"],"not_rendered":{"charts":2,"images":1,"macros":1,"external_links":0,"defined_names":7,"comments":0,"pivot_tables":0},"unopened":[],"bounds":{"document_bytes":16777216,"sheet_cells":100000,"rows_first":2000,"rows_last":500,"rows_between":2000,"halvings":0,"cell_chars":16384,"cell_head_chars":4096},"cells_cut":0,"cells_raw":0,"read":"whole","date_system":"1900"}

{"sheet":"Suivi","index":0,"n_rows":26,"n_cols":5,"rows_kept":26,"cut":false,"hidden":false,"merged":[[1,2,1,4],[2,2,2,4],[3,2,3,4],[4,2,4,4],[11,1,11,4],[5,2,5,4],[6,2,6,4],[7,2,7,4],[8,2,8,4],[9,2,9,4],[10,2,10,4],[13,2,13,4],[14,2,14,4],[15,2,15,4],[16,1,16,4],[12,2,12,4]]}
[]
[null,null,"ROC V1\nCatalogue des cas de tests internes\nPré-requis pour la vérification de conformité"]
[null,"Description : ","Le catalogue des cas de tests internes ROC V1 est à destination des AMC. Il permet de connaitre :\n- les cas de tests internes ;\n- les bénéficiaires à paramétrer ;\n- les établissements qui seront utilisés. \nLes onglets du catalogue sont (en bleu) : \"Cas de tests internes\", \"Indicateurs Tests\", \"Liste des bénéficiaires\" et \"Liste des ETS\".\n\nLes onglets des pré-requis sont (en jaune) : \"Bénéficiaires\", \"Configuration\", \"Contacts\" et \"Remarques\".\nCes pré-requis sont à envoyer complétés au support ( support.amc@kereval.com ) au plus tard la veille du début de la vérification de conformité."]
[null,"Feuille 1 :","Cas de tests internes"]
[null,"Feuille 2 :","Indicateurs Tests"]
[null,"Feuille 3 :","Liste des Bénéficiaires"]
[null,"Feuille 4 :","Liste des ETS"]
[null,"Feuille 5 :","Bénéficiaires"]
[null,"Feuille 6 :","Configuration"]
[null,"Feuille 7 :","Contacts"]
[null,"Feuille 8 :","Remarques"]
[null,"Informations sur le document"]
[null,"Niveau de confidentialité : ","2 - Restreint"]
[null,"Etat :","Validé"]
[null,"Référence : ","CATALOGUE_ET_PREREQUIS_VERIFICATION_CONFORMITE_AMC"]
[null,"Nom du Projet :","ROC V1"]
[null,"Suivi du document"]
[null,"Version","Auteur","Date","Modifications"]
[null,"1.01","KEREVAL","2021-12-01","Création"]
[null,"1.02","KEREVAL","2021-12-02","Revue et validation"]
{"$rows_left_out":7}
{"sheet":"Cas de tests internes","index":1,"n_rows":250,"n_cols":11,"rows_kept":250,"cut":false,"hidden":false,"merged":[[1,1,2,2],[1,3,2,3],[1,4,2,4],[1,5,2,5],[1,6,1,8],[3,1,3,9],[27,1,27,10],[28,3,31,3],[28,4,31,4],[28,5,31,5],[28,6,31,6],[28,7,31,7],[28,8,31,8],[28,10,31,10],[7,1,7,9],[16,1,16,9],[22,1,22,9],[25,1,26,2],[25,3,26,3],[25,4,26,4],[25,5,26,5],[25,6,25,8],[25,9,25,10],[39,1,39,10],[40,3,42,3],[40,4,42,4],[40,5,42,5],[40,6,42,6],[40,7,42,7],[40,8,42,8],[40,10,42,10],[32,1,32,10],[33,3,38,3],[33,4,38,4],[33,5,38,5],[33,6,38,6],[33,7,38,7],[33,10,38,10],[47,1,47,10],[48,3,50,3],[48,4,50,4],[48,5,50,5],[48,6,50,6],[48,7,50,7],[48,8,50,8],[48,10,50,10],[43,1,43,10],[44,3,46,3],[44,4,46,4],[44,5,46,5],[44,6,46,6],[44,7,46,7],[44,8,46,8],[44,10,46,10],[57,1,57,10],[58,3,62,3],[58,4,62,4],[58,5,62,5],[58,6,62,6],[58,7,62,7],[58,8,62,8],[58,10,62,10],[51,1,51,10],[52,3,56,3],[52,4,56,4],[52,5,56,5],[52,6,56,6],[52,7,56,7],[52,8,56,8],[52,10,56,10],[66,1,66,10],[67,3,69,3],[67,4,69,4],[67,5,69,5],[67,6,69,6],[67,7,69,7],[67,8,69,8],[67,10,69,10],[63,1,63,10],[64,3,65,3],[64,4,65,4],[64,5,65,5],[64,6,65,6],[64,7,65,7],[64,8,65,8],[64,10,65,10],[76,1,76,10],[77,3,80,3],[77,4,80,4],[77,5,80,5],[77,6,80,6],[77,7,80,7],[77,8,80,8],[77,10,80,10],[70,1,70,10],[71,3,75,3],[71,4,75,4],[71,5,75,5],[71,6,75,6],[71,7,75,7],[71,8,75,8],[71,10,75,10],[84,1,84,10],[85,3,87,3],[85,4,87,4],[85,5,87,5],[85,6,87,6],[85,7,87,7],[85,8,87,8],[85,10,87,10],[81,1,81,10],[82,3,83,3],[82,4,83,4],[82,5,83,5],[82,6,83,6],[82,7,83,7],[82,8,83,8],[82,10,83,10],[94,1,94,10],[95,3,97,3],[95,4,97,4],[95,5,97,5],[95,6,97,6],[95,7,97,7],[95,8,97,8],[95,10,97,10],[88,1,88,10],[89,3,93,3],[89,4,93,4],[89,5,93,5],[89,6,93,6],[89,7,93,7],[89,8,93,8],[89,10,93,10],[102,1,102,10],[103,3,104,3],[103,4,104,4],[103,5,104,5],[103,6,104,6],[103,7,104,7],[103,8,104,8],[103,10,104,10],[98,1,98,10],[99,3,101,3],[99,4,101,4],[99,5,101,5],[99,6,101,6],[99,7,101,7],[99,8,101,8],[99,10,101,10],[109,1,109,10],[110,3,112,3],[110,4,112,4],[110,5,112,5],[110,6,112,6],[110,7,112,7],[110,8,112,8],[110,10,112,10],[105,1,105,10],[106,10,108,10],[106,7,108,7],[106,6,108,6],[106,5,108,5],[106,4,108,4],[106,3,108,3],[106,8,108,8],[116,1,116,10],[117,3,125,3],[117,4,125,4],[117,5,125,5],[117,6,125,6],[117,7,125,7],[117,8,125,8],[117,10,125,10],[114,1,115,2],[114,3,115,3],[114,4,115,4],[114,5,115,5],[114,6,114,8],[114,9,114,10],[136,1,136,10],[137,3,141,3],[137,4,141,4],[137,5,141,5],[137,6,141,6],[137,7,141,7],[137,8,141,8],[137,10,141,10],[126,1,126,10],[127,3,135,3],[127,4,135,4],[127,5,135,5],[127,6,135,6],[127,7,135,7],[127,8,135,8],[127,10,135,10],[150,1,150,10],[151,3,155,3],[151,4,155,4],[151,5,155,5],[151,6,155,6],[151,7,155,7],[151,8,155,8],[151,10,155,10],[142,1,142,10],[143,3,149,3],[143,4,149,4],[143,5,149,5],[143,6,149,6],[143,7,149,7],[143,8,149,8],[143,10,149,10],[162,1,162,10],[163,3,167,3],[163,4,167,4],[163,5,167,5],[163,6,167,6],[163,7,167,7],[163,10,167,10],[156,1,156,10],[157,3,161,3],[157,4,161,4],[157,5,161,5],[157,6,161,6],[157,7,161,7],[157,10,161,10],[173,1,173,10],[174,3,182,3],[174,4,182,4],[174,5,182,5],[174,6,182,6],[174,7,182,7],[174,8,182,8],[174,10,182,10],[168,1,168,10],[169,3,172,3],[169,4,172,4],[169,5,172,5],[169,6,172,6],[169,7,172,7],[169,10,172,10],[196,1,196,10],[197,3,202,3],[197,4,202,4],[197,5,202,5],[197,6,202,6],[197,7,202,7],[197,8,202,8],[197,10,202,10],[183,1,183,10],[184,3,195,3],[184,4,195,4],[184,5,195,5],[184,6,195,6],[184,7,195,7],[184,8,195,8],[184,10,195,10],[213,1,213,10],[214,3,218,3],[214,4,218,4],[214,5,218,5],[214,6,218,6],[214,7,218,7],[214,8,218,8],[214,10,218,10],[203,1,203,10],[204,3,212,3],[204,4,212,4],[204,5,212,5],[204,6,212,6],[204,7,212,7],[204,8,212,8],[204,10,212,10],[224,1,224,10],[225,3,231,3],[225,4,231,4],[225,5,231,5],[225,6,231,6],[225,7,231,7],[225,8,231,8],[225,10,231,10],[219,1,219,10],[220,3,223,3],[220,4,223,4],[220,5,223,5],[220,6,223,6],[220,7,223,7],[220,8,223,8],[220,10,223,10],[240,1,240,10],[241,3,249,3],[241,4,249,4],[241,5,249,5],[241,6,249,6],[241,7,249,7],[241,8,249,8],[241,10,249,10],[232,1,232,10],[233,3,239,3],[233,4,239,4],[233,5,239,5],[233,6,239,6],[233,7,239,7],[233,8,239,8],[233,10,239,10]]}
[]
[null,"Cas de tests transverses",null,"Obligatoire ou facultatif","Bénéficiaire","Établissement","Date d'admission",null,null,"Résultat obtenu"]
[null,null,null,null,null,null,"Consigne","À renseigner","Automatique","Test"]
[null,"Test 1 : IDENTIFICATION DE L’ETS ROC COMPATIBLE"]
[null,"ETS_NON_HABILITE","L’AMC bloque un ETS « non habilité »","Obligatoire","BENEF_01","ETS_02 ","Date du jour ",null,"x","NO RUN"]
[null,"ETS_KO_PROD_SOUS_SURVEILLANCE","L’AMC bloque un ETS en production sous surveillance ","Obligatoire","BENEF_01","ETS_03 ","Date du jour ",null,"x","NO RUN"]
[null,"ETS_OK_PROD_SOUS_SURVEILLANCE","L’AMC autorise un ETS en production sous surveillance","Facultatif","BENEF_01","ETS_04","Date du jour ",null,"x","NO RUN"]
[null,"Test 2 : IDENTIFICATION DU BENEFICIAIRE"]
[null,"BENEF_INCONNU","Rejet pour bénéficiaire inconnu","Obligatoire","BENEF_09","ETS_01","Date du jour ",null,"x","NO RUN"]
[null,"BENEF_DROITS_FERMES","L’AMC indique que le bénéficiaire n’a plus de droit à la date prévisionnelle des soins","Obligatoire","BENEF_02","ETS_01","Date du jour ",null,"x","NO RUN"]
[null,"BENEF_DROITS_SUSPENDUS","L’AMC indique que le bénéficiaire a des droits suspendus","Obligatoire","BENEF_07","ETS_01","Date du jour - 10J",null,"x","NO RUN"]
[null,"SANS_NUM_ADH","Pour les AMC qui attribuent un n° adhérent à leurs assurés : l’AMC indique qu’il faut compléter la demande IDB avec le numéro adhérent ","Obligatoire","BENEF_04","ETS_01","Date du jour ",null,"x","NO RUN"]
[null,"CV_DIFF_CONTRAT","L’AMC retrouve le bénéficiaire à partir d’une carte vitale différente du contrat AMC","Obligatoire","BENEF_03","ETS_01","Date du jour ",null,"x","NO RUN"]
[null,"CV_EGALE_CONTRAT","L’AMC retrouve le bénéficiaire à partir d’une carte vitale identique à du contrat AMC","Obligatoire","BENEF_10","ETS_01","Date du jour ",null,"x","NO RUN"]
[null,"NUM_ADH_CV_DIFF_CONTRAT","Pour les AMC qui attribuent un n° adhérent à leurs assurés : l’AMC retrouve le bénéficiaire à partir d’une carte vitale différente du contrat AMC","Obligatoire","BENEF_03","ETS_01","Date du jour ",null,"x","NO RUN"]
[null,"SANS_NUM_ADH_CV_DIFF_CONTRAT","Pour les AMC qui n’attribuent pas un n° adhérent à leurs assurés : l’AMC renseigne systématique le numéro adhérent lorsqu’il est absent","Obligatoire","BENEF_04","ETS_01","Date du jour ",null,"x","NO RUN"]
[null,"Test 3 : VALIDITE DES REPONSES IDB / DATES"]
[null,"BENEF_DROITS_OUVERTS_EXTE","L’AMC indique que l’assuré a des droits ouverts en ACE","Obligatoire","BENEF_05","ETS_01","< Date de fin de contrat - 15J","x",null,"NO RUN"]
[null,"BENEF_DROITS_OUVERTS_HOSP","L’AMC indique que l’assuré a des droits ouverts pour la totalité de la durée prévisionnelle du séjour ","Obligatoire","BENEF_06","ETS_01","\n< Échéance renouvellement - 5J","x",null,"NO RUN"]
[null,"DROITS_OUVERTS_PARTIE_DUREE_HOSP","L’AMC indique que l’assuré a des droits ouverts pour une partie de la durée prévisionnelle du séjour","Obligatoire","BENEF_08","ETS_01","< Date de fin de contrat - 3J","x",null,"NO RUN"]
{"$rows_left_out":231}
{"sheet":"Indicateurs Tests","index":2,"n_rows":27,"n_cols":13,"rows_kept":27,"cut":false,"hidden":false,"merged":[[23,2,23,3],[2,2,3,9],[2,11,3,18],[5,2,5,3],[5,11,5,12]]}
[]
[]
[null,null,"Cas de tests",null,null,null,null,null,null,null,null,"Scénario de tests"]
[]
[]
[null,null,"Nombre de test",null,null,null,null,null,null,null,null,"Nombre de scénario"]
[null,null,null,"Total",null,null,null,null,null,null,null,null,"Total"]
[null,null,"OK",{"$f":"COUNTIF('Cas de tests internes'!J:J,\"OK\")","v":0},null,null,null,null,null,null,null,"OK",{"$f":"COUNTIF('Cas de tests internes'!K:K,\"OK\")","v":0}]
[null,null,"KO",{"$f":"COUNTIF('Cas de tests internes'!J:J,\"KO\")","v":0},null,null,null,null,null,null,null,"KO",{"$f":"COUNTIF('Cas de tests internes'!K:K,\"KO\")","v":0}]
[null,null,"NO RUN ",{"$f":"COUNTIF('Cas de tests internes'!J:J,\"NO RUN\")","v":201},null,null,null,null,null,null,null,"NO RUN ",{"$f":"COUNTIF('Cas de tests internes'!K:K,\"NO RUN\")","v":36}]
[null,null,"Total",{"$f":"D8+D9+D10","v":201},null,null,null,null,null,null,null,"Total",{"$f":"M8+M9+M10","v":36}]
[]
[null,null,"Avancement",{"$f":"(D8+D9)/(D8+D9+D10)","v":0},null,null,null,null,null,null,null,"Avancement",{"$f":"(M8+M9)/(M8+M9+M10)","v":0}]
[]
[]
[]
[]
[]
[]
[]
{"$rows_left_out":8}
{"sheet":"Liste des Bénéficiaires","index":3,"n_rows":57,"n_cols":3,"rows_kept":57,"cut":false,"hidden":false,"merged":[[38,2,39,2],[38,1,39,1],[1,1,2,1],[1,2,2,2],[16,1,17,1],[16,2,17,2]]}
[]
[null,"ID","Description Bénéficiaire - Cas Transverses"]
[]
[null,"BENEF_01","Bénéficiaire classique assuré depuis plus de 365 jours"]
[null,"BENEF_02","Bénéficiaire dont le contrat est résilié"]
[null,"BENEF_03","Bénéficiaire avec un enfant présent sur le contrat de la mère (Ouvrant-droit celui du père)"]
[null,"BENEF_04","Bénéficiaire avec un enfant présent sur le contrat du père (Ouvrant-droit celui du mère)"]
[null,"BENEF_05","Bénéficiaire classique, l'ouvrant droit et le bénéficiaire de soins sont la même personne, la date de fin de contrat connue et postérieure au jour de la demande + 15 jours"]
[null,"BENEF_06","Bénéficiaire classique assuré de plus de 365 jours, l'ouvrant droit et le bénéficiaire de soins sont la même personne. Date échéance de renouvellement égale à  la date d'admission + 5 jours."]
[null,"BENEF_07","Bénéficiaire avec un contrat suspendu depuis J-7"]
[null,"BENEF_08","Bénéficiaire avec des droits ouverts le jour de la demande, mais une date de fin de contrat connue à J+3"]
[null,"BENEF_09","Bénéficiaire inconnu par l'AMC"]
[null,"BENEF_10","Bénéficiaire avec un enfant présent sur le contrat du père (Ouvrant-droit celui du père)"]
[null,"BENEF_11","Bénéficiaire avec une date de début de contrat postérieure à la date d’admission"]
[]
[]
[null,"ID","Description Bénéficiaire - Cas ACE"]
[]
[null,"BENEF_A001","Bénéficiaire du scénario A001 avec des droits ouverts et bénéficie d’un contrat responsable"]
[null,"BENEF_A002","Bénéficiaire du scénario A002 avec des droits ouverts et bénéficie d’un contrat responsable"]
{"$rows_left_out":38}
{"sheet":"Liste des ETS","index":4,"n_rows":11,"n_cols":9,"rows_kept":11,"cut":false,"hidden":false,"merged":[[3,1,4,1],[3,2,4,2],[3,3,4,3],[3,4,4,4],[3,5,3,8]]}
[]
[null,"Voici la liste des ETS qui seront utilisés pour la vérification de conformité, ils sont à déclarer dans votre SI. Un fichier SGETS, contenant ces ETS est disponible en téléchargement sur la plateforme de tests."]
[]
[null,"ID","Description","Nom","NumFact","ComplementEs"]
[null,null,null,null,null,"FinessGeo","FinessJur","StatutJur","Categorie"]
[null,"ETS_01","Établissement de santé public démarré habilité","ETS PUBLIC 01",{"$f":"G6&F6","v":"990009136990792590"},990792590,990009136,13,355]
[null,"ETS_02","Établissement de santé public non démarré","ETS PUBLIC 02",{"$f":"G7&F7","v":"990008898990792558"},990792558,990008898,13,355]
[null,"ETS_03","Établissement de santé public démarré sous surveillance","ETS PUBLIC 03","990009110990792632",990792632,990009110,13,355]
[null,"ETS_04","Établissement de santé public démarré sous surveillance et paramétré partenaire de tests ROC","ETS PUBLIC 04","990009128990792541",990792541,990009128,13,355]
[null,"ETS_05","Établissement de santé PNL démarré habilité","ETS PNL 01 ","990009045990792566",990792566,990009045,65,131]
[null,"ETS_06","Établissement de santé HIA démarré habilité","ETS HIA 01","990009995990792574",990792574,990009995,"01",114]

{"sheet":"Bénéficiaires","index":5,"n_rows":71,"n_cols":22,"rows_kept":71,"cut":false,"hidden":false,"merged":[[59,1,67,1],[3,1,4,2],[5,11,22,11],[49,1,50,2],[51,1,53,1],[54,1,58,1],[26,1,27,2],[28,1,30,1],[31,1,35,1],[36,1,44,1],[5,1,7,1],[8,1,12,1],[13,1,21,1]]}
[]
[null,null,"Veuillez renseigner les information pour les différents bénéficiaires présents sur votre SI"]
[]
[null,"Spécificités bénéficiaires (Cas Transverses)",null,"Bénéficiaire classique assuré depuis plus de 365 jours","Bénéficiaire dont le contrat est résilié","Bénéficiaire avec un enfant présent sur le contrat de la mère \n(Ouvrant-droit celui du père)","Bénéficiaire avec un enfant présent sur le contrat du père\n(Ouvrant-droit celui du mère)","Bénéficiaire classique, l'ouvrant droit et le bénéficiaire de soins sont la même personne, la date de fin de contrat est connue et postérieure au jour de l'admission + 15 jours","Bénéficiaire classique assuré de plus de 365 jours, l'ouvrant droit et le bénéficiaire de soins sont la même personne, la date d' échéance de renouvellement est à date d'admission + 5 jours","Bénéficiaire avec un contrat suspendu depuis J-7","Bénéficiaire avec des droits ouverts le jour de la demande, mais une date de fin de contrat connue à J+3","Bénéficiaire inconnu par l'AMC","Bénéficiaire avec un enfant présent sur le contrat du père\n(Ouvrant-droit celui du père)","Bénéficiaire avec une date de début de contrat postérieure à la date d’admission"]
[null,null,null,"BENEF_01","BENEF_02","BENEF_03","BENEF_04","BENEF_05","BENEF_06","BENEF_07","BENEF_08","BENEF_09","BENEF_10","BENEF_11"]
[null,"AMC","N° AMC\n(Généralement sur 9 caractères pour les mutuelles et 8 pour les assurances et les instituts de prévoyance)",null,null,null,null,null,null,null,null,"BENEF_09 pré-renseigné dans le projet SoapUi "]
[null,null,"Type de convention \n(2 caractères)"]
[null,null,"Critère Secondaire de Routage \n(Facultatif - 3 caractères)"]
[null,"Ouvrant droit \n- ODR","NIR - Ouvrant droit\n(13 caractères)"]
[null,null,"Clé - Ouvrant droit\n(2 caractères)"]
[null,null,"Code régime AMO\n(Facultatif - 2 caractères)"]
[null,null,"Code caisse AMO\n(Facultatif - 3 caractères)"]
[null,null,"Code centre AMO\n(Facultatif - 4 caractères)"]
[null,"Bénéficiaire - BENEF","N° adhérent\n(15 caractères maximum)"]
[null,null,"Nom\n(64 caractères maximum)"]
[null,null,"Prénom\n(64 caractères maximum)"]
[null,null,"NIR - Bénéficiaire de soins\n(13 caractères)"]
[null,null,"Clé - Bénéficiaire de soins\n(2 caractères)"]
[null,null,"Date naissance \n(Format : AAAA-MM-JJ)"]
[null,null,"Rang naissance\n(1 caractère entre 1 et 9)"]
{"$rows_left_out":52}
{"sheet":"Configuration","index":6,"n_rows":22,"n_cols":5,"rows_kept":22,"cut":false,"hidden":false,"merged":[]}
[]
[null,"Veuillez renseigner les informations pour l'envoi de DRE-ES sur votre SI"]
[]
[null,"Type de destinataire (OC ou CS)"]
[null,"Numéro destinataire"]
[null,"Domaine"]
[null,"Identification hôte gestionnaire"]
[null,"Code routage"]
[null,"BAL DRE",null,null,"BAL DRE = DRE.XX.NNN.0@amc.rss.fr ou DRE.NumDest.NNN.0@amc.rss.fr"]
[null,null,null,null,"Avec : "]
[null,null,null,null,"XX = code routage"]
[null,null,null,null,"NNN = id hôte gestionnaire"]
[null,null,null,null,"amc.rss.fr = nom de domaine"]
[null,null,null,null,"NumDest = numéro destinataire"]
[]
[null,"Veuillez renseigner les informations pour les échanges IDB/CLC/SIM/DEL sur votre SI"]
[null,"Attention : Les URLs ci-dessous doivent être identiques avec les URLs renseignés dans l'Annuaire de Démo"]
[]
[null,"URL de test pour IDB"]
[null,"URL de test pour CLC"]
{"$rows_left_out":3}
{"sheet":"Contacts","index":7,"n_rows":6,"n_cols":5,"rows_kept":6,"cut":false,"hidden":false,"merged":[]}
[]
[null,"Veuillez renseigner au moins 2 lignes téléphoniques + mails avec lesquels nous pourrons vous contacter pour la vérification de conformité"]
[]
[null,"Contact","Prénom + nom","Mail","Tel"]
[null,"Contact de la personne technique\n(qui travaillera sur les DRE-ES/RSP 578R/RSP 908R et sur les services en ligne IDB/CLC/SIM/DEL)"]
[null,"Contact de la personne administrative\n(pour les points d'avancements et contrat)"]

{"sheet":"Remarques","index":8,"n_rows":28,"n_cols":3,"rows_kept":28,"cut":false,"hidden":false,"merged":[[25,1,26,1]]}
[]
[null,"Remarques"]
[null,null,"* Dans les DRE-ES, la valeur du « sens comptable » sera à « 6 ». Assurez-vous que votre SI accepte bien cette valeur."]
[null,null,"* Les ETS que nous utiliserons dans les cas de tests seront les mêmes que durant vos tests internes. \nCependant, si vous n’avez plus ces ETS déclarés, il vous faudra les ajouter dans votre SI. Ils sont disponibles dans le fichier SGETS et dans l'onglet \"Liste des ETS\" de ce fichier. "]
[null,null,"* Lors des tests de bout en bout, nous allons modifier un de ces ETS dans le fichier SGETS et vérifier sa mise à jour sur votre SI."]
[]
[null,null,"Vous trouverez ci-dessous un résumé du déroulement de la vérification de conformité ROC"]
[null,null,"https://inter-amc.kereval.com/docs/"]
[]
[null,"Points d'attention"]
[null,null,"Assurez vous que"]
[null,null,"* Votre SI et les URL de tests des web services sont bien accessibles de l'extérieur."]
[null,null,"* Votre AMC (ou celle que vous couvrez) est bien déclarée dans l'Annuaire AMC de Démo avec les bonnes URL de tests."]
[null,null,"* Les modifications sur votre SI sont autorisées lors du passage préparatoire."]
[null,null,"* Les modifications sur votre SI ne sont pas autorisées lors du passage en vérification de conformité."]
[null,null,"* Les jeux de données et les bénéficiaires ne doivent pas être modifiés lors du passage en vérification de conformité."]
[null,null,"* Les ETS à déclarer dans votre SI doivent être définis comme exerçant depuis plus d'un an."]
[]
[null,"Aspect Sécurité"]
[null,null,"* Vous avez bien pris en compte et installé les certificats présents sur le site de la complementaire santé"]
{"$rows_left_out":9}
{"sheet":"Paramétrage SoapUi","index":9,"n_rows":979,"n_cols":1,"rows_kept":979,"cut":false,"hidden":false,"merged":[]}
["**Il est possible de générer le fichier .txt à partir du document \"KER2-ROCV1-CATALOGUE_ET_PREREQUIS_VERIFICATION_CONFORMITE_AMC-X_XX\" disponible : https://inter-amc.kereval.com/CatalogueROC/ **"]
[]
[{"$f":"'Fichier de paramétrage vierge'!A1","v":"**Endpoint à renseigner par l'AMC**"}]
[{"$f":"'Fichier de paramétrage vierge'!A2&Configuration!C19","v":"endpointIDB="}]
[{"$f":"'Fichier de paramétrage vierge'!A3&Configuration!C20","v":"endpointCLC="}]
[{"$f":"'Fichier de paramétrage vierge'!A4&Configuration!C21","v":"endpointSIM="}]
[{"$f":"'Fichier de paramétrage vierge'!A5&Configuration!C22","v":"endpointDEL="}]
[]
[{"$f":"'Fichier de paramétrage vierge'!A7","v":"**Repertoire où se trouve le dossier de test. /!\\ Mettre deux \\ en fin de ligne. **"}]
[{"$f":"'Fichier de paramétrage vierge'!A8","v":"**Exemple : xml_repertoire=MonRepertoire\\Simulateur ETS\\CasDeTestsAMC\\\\**"}]
[{"$f":"'Fichier de paramétrage vierge'!A9","v":"xml_repertoire="}]
[]
[{"$f":"'Fichier de paramétrage vierge'!A11","v":"**Toutes les informations sur les bénéficiaires doivent être renseignées ici**"}]
[]
[{"$f":"'Fichier de paramétrage vierge'!A13","v":"****** CAS TRANSVERSE *****"}]
[]
[{"$f":"'Fichier de paramétrage vierge'!A15","v":"****** Bénéficiaire classique assuré depuis plus de 365 jours ******"}]
[{"$f":"'Fichier de paramétrage vierge'!A16&Bénéficiaires!D9","v":"ODR_01_NIR="}]
[{"$f":"'Fichier de paramétrage vierge'!A17&Bénéficiaires!D10","v":"ODR_01_CLE_NIR="}]
[{"$f":"'Fichier de paramétrage vierge'!A18&Bénéficiaires!D11","v":"ODR_01_CODE_REGIME_AMO="}]
{"$rows_left_out":960}
{"sheet":"Fichier de paramétrage vierge","index":10,"n_rows":977,"n_cols":1,"rows_kept":977,"cut":false,"hidden":true,"merged":[]}
["**Endpoint à renseigner par l'AMC**"]
["endpointIDB="]
["endpointCLC="]
["endpointSIM="]
["endpointDEL="]
[]
["**Repertoire où se trouve le dossier de test. /!\\ Mettre deux \\ en fin de ligne. **"]
["**Exemple : xml_repertoire=MonRepertoire\\Simulateur ETS\\CasDeTestsAMC\\\\**"]
["xml_repertoire="]
[]
["**Toutes les informations sur les bénéficiaires doivent être renseignées ici**"]
[]
["****** CAS TRANSVERSE *****"]
[]
["****** Bénéficiaire classique assuré depuis plus de 365 jours ******"]
["ODR_01_NIR="]
["ODR_01_CLE_NIR="]
["ODR_01_CODE_REGIME_AMO="]
["ODR_01_CODE_CAISSE_AMO="]
["ODR_01_CODE_CENTRE_AMO="]
{"$rows_left_out":957}